☰
AHB、APB、AXI总线对比:SoC与FPGA选型实践
2026/11/3 7:44:23 网站建设 项目流程

总线这个话题,很多做SoC集成和FPGA原型的同行都绕不开,但真正能把AHB、APB、AXI这三兄弟的脾气摸透的人不算多。我自己踩过的坑是:早期做一个图像采集的小系统,图省事把所有外设都挂到一条高性能总线上,结果综合出来面积超了预算,时序也收敛不了,最后只能返工重排拓扑。这件事让我明白,AHB、APB、AXI总线对比不是纸面上的参数罗列,而是关于带宽、延迟、面积、功耗和验证成本之间如何取舍的工程决策。这篇内容会把三种总线的设计动机、协议机制、时序细节和选型判据一层层拆开,结合实际挂载案例讲清楚"为什么这么设计"和"什么时候该选哪一个"。适合正在做芯片前端集成、IP对接、FPGA系统搭建或者驱动底层调试的读者,小白能看懂整体逻辑,有经验的同行能从中找到可以直接复用的参数和排查思路。

1. 三种总线的分层定位与选型动机

1.1 总线不是越强越好:带宽、延迟、面积的三元权衡

刚接触这套规范的人常有一个直觉:既然AXI性能最强,为什么不全用AXI?这个想法在纸面上很合理,落到工程里几乎一定会出问题。原因在于总线的性能从来不是免费的,它用面积、功耗、时序收敛难度和验证工作量来换。一条完整的AXI接口,仅五组通道的握手信号加地址、数据、ID、属性字段就上百根线,一个从设备接口要完整实现这些逻辑,寄存器开销和组合逻辑深度都远超APB。相比之下,APB一个从设备接口的核心信号不超过十根,状态机只有三个状态,新手半天就能看明白。

我习惯用城市路网来类比:AXI是立体高架加多车道,适合城市间的大流量运输;AHB是城市主干道,红绿灯少、通行效率高,但只有一个方向的车道组;APB则是小区内部道路,窄、慢,但接入成本极低,拐个弯就到家门口。你不会为了让快递三轮车跑得快,专门给它修一条高架。同样的道理,一个8位定时器、一个看门狗、一组GPIO寄存器,数据吞吐需求以KB/s计,挂到AXI上除了浪费面积没有任何收益,反而因为接口复杂引入了更多验证风险。

这里有个量化的判断标准值得记住:当外设的峰值带宽需求低于总线理论带宽的5%时,基本可以考虑降级到更低速的总线。举例来说,一条100MHz、32位宽的APB,理论带宽400MB/s,实际因为两相时序效率大约在50%,也就是200MB/s左右。一个UART的波特率哪怕到4Mbps,换算成字节也就500KB/s,占用率0.25%。这种量级的需求,任何高性能总线对它都是浪费。反之,一个DDR控制器或者图像DMA,动辄需要几百MB/s到GB/s的持续吞吐,这时候APB的时序效率就成了瓶颈,必须上AHB或者AXI。

1.2 典型拓扑:从主设备到外设的分层结构

实际系统里,三种总线很少单打独斗,通常是分层组合。典型结构是这样的:处理器内核和高速主设备(DMA、图像处理单元、存储控制器)挂在AXI或者AHB这一层;中间通过一个桥接模块,把高速域连接到低速的APB域;APB域上再挂各种控制类外设,比如串口、定时器、中断控制器、电源管理寄存器。

这种分层带来两个直接好处。第一是时钟域隔离,高速域跑200MHz甚至更高,低速外设域跑50MHz足够,桥接模块内部做跨时钟域处理,两边各自按自己的节奏工作。第二是地址空间清晰,高速设备和低速外设分属不同的地址段,软件侧访问时不会互相干扰,调试时也容易定位问题出在哪一段。

分层也有代价。每一级桥接都会引入额外的延迟,一个访问从处理器发出,穿过AXI到AHB桥,再到AHB到APB桥,最后到达外设,累积延迟可能达到十几个甚至几十个时钟周期。对于寄存器配置这类操作,延迟无所谓;但如果是有实时性要求的控制回路,就要评估这个延迟是否可接受。我在一个电机控制类项目里就遇到过这个问题:控制环要求在固定周期内完成一次采样加输出,桥接延迟把裕量吃掉了一大半,最后把关键外设单独提到AHB上才解决。

所以在画拓扑之前,先列出所有主设备和从设备,标出各自的带宽需求、延迟敏感度和访问频率,再决定谁挂在哪一层。这个清单做扎实了,后面的选型基本不会返工。下面这张表是我自己常用的分配参考,实际项目里可以按需微调。

设备类型典型带宽需求延迟敏感度推荐总线
处理器内核取指与数据高高AXI 或 AHB
DMA控制器高中AXI
片内SRAM控制器高高AXI 或 AHB
图像/音频数据通路高中AXI
中断控制器极低高APB
定时器、看门狗极低低APB
串口、I2C、SPI低中APB
GPIO与引脚复用寄存器极低低APB
电源管理与时钟控制极低低APB

2. AHB的核心机制与适用边界

2.1 流水线式传输:地址相位与数据相位分离

AHB最关键的设计是把一次传输拆成地址相位和数据相位两个阶段,并且让它们流水起来。地址相位持续一个周期,主设备在这个阶段给出地址和控制信号;数据相位紧接着开始,持续一个或多个周期,用来搬数据。关键在于,当第一笔传输进入数据相位时,第二笔传输的地址相位已经可以同时进行了。这种重叠让AHB在连续传输时每个周期都能完成一笔地址握手,理论吞吐接近每周期一笔。

实现这个流水线的核心信号是HREADY。从设备或者总线互联通过拉低HREADY来插入等待周期,主设备看到HREADY为低,就把当前的地址相位延长,同时数据相位也暂停。这里有个新手容易搞混的点:HREADY影响的是上一笔传输的数据相位和当前这笔传输的地址相位,两者是联动的。调试时如果发现地址明明发出去了但从设备没反应,先看HREADY是不是被一直拉低,再看HTRANS是否给到了NONSEQ或者SEQ。

地址相位里的HTRANS编码值得单独说一下。IDLE表示没有传输,BUSY表示主设备正在忙但下一笔还没准备好,NONSEQ表示一次非连续传输(突发的第一笔),SEQ表示连续突发的后续笔。BUSY这个状态很多人第一次见会懵,它的作用是让主设备在不中断突发的情况下插入空闲周期,从设备必须能正确处理,不能在BUSY期间误采样地址。我见过一个自研从设备漏判BUSY状态,把BUSY当成有效传输,结果数据错位,排查了两天才定位到。

2.2 突发传输与1KB边界:为什么要有这条硬约束

AHB支持增量突发和回卷突发,突发长度可选4、8、16拍,也支持不定长突发。但有一条硬性规则:任何突发都不能跨越1KB地址边界。这条规则不是随便定的,根源在于从设备的地址译码方式。大多数从设备内部按1KB或者更大的页来划分存储体,如果一笔突发跨了页,从设备就没法在突发开始前确定这笔传输全部落在自己的地址范围内。

举个具体例子:总线位宽32位,也就是每拍4字节。起始地址是0x0000_03F8,那么到1KB边界0x0000_0400还有8字节,也就是只能连续走2拍。如果主设备发起的是16拍增量突发,就必须在边界处拆成两笔。这个拆分一般由主设备侧的逻辑或者总线互联完成,但如果主设备是个粗糙的DMA,很容易忽略这件事。后果是什么?轻则传输被从设备拒绝返回错误响应,重则地址绕回到低地址,数据写到错误位置,而且这种错误往往在功能测试阶段不易暴露,等到跑长时间压力测试才偶发,非常难查。

我的做法是在DMA配置阶段就做地址和长度的合法性检查,把突发按边界预拆好,而不是指望硬件自动处理。写驱动时也建议留一个断言,检查起始地址加上传输字节数是否跨边界,早期发现比后期排查便宜得多。

2.3 仲裁机制与从设备响应类型

AHB是多主设备总线,需要一个仲裁器来决定当前谁拿到总线。仲裁器观察每个主设备的HBUSREQ请求,结合优先级策略给出HGRANT。这里有个细节容易被忽略:主设备拿到授权不等于立刻能发起传输,它还要等当前这笔传输的数据相位结束,也就是HREADY为高的那个周期,才能在下一个周期开始自己的地址相位。这个规则保证了总线不会在传输中途被抢占,避免数据被截断。

从设备的响应类型有三种:OKAY、ERROR和RETRY/SPLIT。OKAY是正常完成;ERROR表示访问出错,比如地址越界或者权限不足,主设备收到后一般会触发异常或者记录错误状态。RETRY和SPLIT稍微复杂一些,它们让从设备在暂时无法处理时把总线释放出来,交给其他主设备使用,等自己准备好了再申请恢复。SPLIT比RETRY更适合慢速从设备,因为它真正释放了总线,而RETRY会让主设备反复重试,占用仲裁带宽。

实际项目里,大部分简单系统用不到SPLIT,因为从设备响应都很快。但如果系统里有访问延迟很大的从设备,比如外部存储接口或者跨时钟域的桥接,SPLIT就能明显改善总线利用率。需要提醒的是,SPLIT的实现复杂度不低,主设备要能记录被拆分的传输上下文,仲裁器要维护待恢复请求的队列,验证工作量也会上去。如果系统主设备不多、带宽不紧张,用RETRY甚至直接插入等待周期更省事。

2.4 AHB-Lite与AHB5:什么场景下该用哪个版本

AHB-Lite可以理解成单主设备版本的AHB,去掉了请求授权和SPLIT机制,接口信号大幅精简。很多处理器内核对外只提供AHB-Lite接口,这时候接多个主设备就得靠一个多路复用或者互联模块来做。AHB-Lite的好处是实现简单、时序容易收敛,对于主设备数量少的系统是最优解。

AHB5在AHB-Lite基础上增加了一些面向低功耗和安全特性的信号,比如用于事务属性标记的接口,以及支持独占访问的机制。独占访问对实现原子操作很关键,没有它,软件层的信号量、原子加之类的操作就得靠关中断来凑,效率和可移植性都差。

选择逻辑其实很直白:主设备只有一个,用AHB-Lite;主设备多个且有慢速从设备,用完整AHB;需要原子操作或者更细粒度的访问属性控制,考虑AHB5。不要为了"用新版本"而上新版本,多一根信号就多一份验证和时序压力,尤其在FPGA原型阶段,时序余量本来就紧张。

3. APB的极简哲学与接入要点

3.1 三态时序机:IDLE、SETUP、ACCESS

APB的状态机只有三个状态,这是它最大的优势。IDLE是空闲态,没有传输时停在这里;当PSEL被拉高,状态进入SETUP,此时地址、写入数据、读写方向都已经有效,但还不算真正执行;下一个时钟沿进入ACCESS,PENABLE拉高,从设备在这个阶段完成读写,并通过PREADY告诉总线什么时候可以结束。

这个两阶段设计的意义在于给了从设备充分的准备时间。SETUP阶段相当于一个"预告",从设备看到PSEL和地址后可以开始内部译码、准备数据;ACCESS阶段才是真正采样。对于组合逻辑较深的从设备,这个预告周期能显著缓解时序压力。代价是每笔传输至少两个周期,效率上限50%,这也是APB带宽不高的根本原因。

如果把APB的时序和AHB对比,会发现一个有趣的差异:AHB把地址和数据流水起来追求吞吐,APB则刻意不流水,用简单换效率。这两种思路没有优劣,只有场景匹配。寄存器配置类访问,一次写一个32位值,两周期和三周期的差别在微秒级别,人根本感知不到;但接口逻辑的复杂度差别可能是几百行代码和几十行代码的区别。

3.2 PREADY、PSLVERR与等待周期

PREADY是从设备控制传输节奏的关键。默认情况下从设备应该常拉高,表示永远准备好;需要等待时拉低,总线就停在ACCESS状态等。这个机制让慢速外设不用额外做缓冲,直接把内部等待反映到总线上。

PSLVERR是错误响应信号,只在传输的最后一个周期有效,配合PREADY一起采样。什么时候该拉它?地址越界、写只读寄存器、访问未实现的地址空间,这些都应该返回错误,而不是默默吞掉。我见过一些早期设计为了省事把PSLVERR直接接地,结果软件侧写错地址完全没有反馈,寄存器配置不上还以为是驱动写错了,来回查了半天。

关于等待周期的数量,有一个实践上的建议:单笔APB传输的等待周期最好不要超过十几个。等待太长会拖慢整个低速域的访问节奏,而且如果软件在一个紧密循环里连续访问该外设,累积延迟会很可观。如果某个外设确实需要几十个周期才能返回数据,更好的方案是在外设内部做预取或者加一个小FIFO,把访问变成固定短延迟。

3.3 APB3、APB4、APB5的演进差异

APB最早没有PREADY,从设备必须在一个固定周期内完成响应,灵活性很差。APB3引入了PREADY和PSLVERR,这是使用最广的版本,绝大多数外设IP对接的都是它。APB4增加了保护属性信号,用来标记访问是特权级还是用户级、是否可缓冲,对做安全隔离的系统有用。APB5进一步增加了唤醒信号和用户自定义信号,面向低功耗场景。

选版本的判断很实际:如果系统没有安全隔离和低功耗唤醒需求,APB3完全够用,多出来的信号纯属负担。如果处理器有特权级概念,需要在总线层面做访问权限检查,那APB4的保护属性就有价值。唤醒信号则要看系统是否有深度睡眠模式,需要在睡眠期间让某些外设保持响应能力。

3.4 为什么控制类外设几乎都挂在APB上

除了接口简单,APB还有一个被低估的优势:它的时序非常确定。两相结构加固定握手,让外设的访问延迟容易预测,这对实时控制类应用很重要。而且APB通常挂在低速时钟域,功耗低,对于常年不休眠的控制寄存器组来说,静态功耗的节省是实打实的。

另一个原因是生态。大量现成的外设IP,接口都是APB,改造成本高。你在做系统集成时,如果非要把APB外设包一层转成AXI,多出来的桥接逻辑不仅要验证,还引入了额外延迟和潜在的死锁风险。顺着生态走,用桥接把APB域整体接上去,是最省心的做法。

这里有个实操细节:APB桥接模块的地址译码范围要留足。我见过一个设计,APB域只分配了4KB地址空间,后来要加外设发现不够,只能改地址映射,连带软件侧的宏定义全部要动。建议初期就按实际需求的四倍来规划,地址空间是最便宜的资源,浪费一点无所谓,改起来才是真要命。

4. AXI的通道化架构与高并发设计

4.1 五通道分离:读写地址与数据彻底解耦

AXI最本质的创新是把传输拆成五个独立通道:写地址、写数据、写响应、读地址、读数据。每个通道都有自己的VALID和READY握手,各自独立流动。这意味着写地址可以连续发好几笔而不用等数据,读地址可以一次性发出多个请求,数据回来的时候按ID区分归属。这种解耦带来的并行度是AHB和APB完全不具备的。

VALID和READY的握手规则只有一条铁律:VALID一旦拉高就不能撤销,必须等到READY拉高完成握手。这条规则看似简单,却是很多自研模块出问题的地方。有人在VALID拉高后因为内部状态变化又把VALID拉低,仿真里可能因为时序凑巧没报错,上板后就是偶发的数据丢失。我自己的检查清单里,VALID的稳定性是必查项,用断言监控最省事。

五通道分离还带来一个好处:读写可以真正同时进行。AHB是共享总线,同一时刻只能有一个方向的传输占用总线;AXI的读写通道独立,读数据回来的同时写地址可以继续发,对于需要双向流动的场景,比如网络包处理,效率提升非常明显。

4.2 突发类型、4KB边界与地址计算

AXI支持三种突发类型:FIXED表示地址不变,适合访问FIFO这类固定地址端口;INCR表示地址递增,是最常用的类型;WRAP表示回卷,地址到达上界后绕回起始地址,适合缓存行填充。突发长度方面,AXI3支持1到16拍,AXI4扩展到1到256拍。

4KB边界这条规则和AHB的1KB边界是同一个道理,但因为AXI突发更长,踩坑概率更高。计算方式:起始地址0x0000_0FF0,位宽32位即4字节每拍,到4KB边界0x0000_1000还有16字节,也就是4拍。如果你配了一个16拍的INCR突发从0x0FF0开始,那就是违规的。做DMA配置时,我会写一个简单的预检查:先算边界剩余字节数,再除每拍字节数,得到本次允许的最大拍数,超出就拆包。

对于WRAP突发,规则更细,起始地址必须按传输大小对齐,回卷边界由突发长度决定。这类突发主要在缓存场景用,一般应用里用得少,但如果要对接带缓存的IP,就得老老实实按规范来。

4.3 ID机制、乱序完成与Outstanding深度

ID是AXI实现高并发的核心。每个事务带一个ID标记,从设备返回数据时按ID区分,不同ID的事务可以乱序完成,相同ID的事务必须保序。这个设计让主设备可以同时发出多个请求,谁先准备好谁先回,不用排队等待。

Outstanding指的是已经发出但还没收到响应的事务数量。这个参数直接决定了总线能不能填满带宽。用一个小定律来估算:需要的outstanding数约等于事务往返延迟乘以目标吞吐率。假设从设备平均响应延迟是20个时钟周期,目标是在100MHz下达到每周期一笔的吞吐,那就需要至少20个outstanding。实际设计里通常留一倍余量,配到32或者64。

这个数字配小了会怎样?总线会出现空转,明明从设备有能力处理,但主设备在等响应不敢发新请求,带宽上不去。配大了呢?主设备和从设备两侧都要有足够的缓冲来记录在途事务,面积上去了,而且如果某个ID的事务长期不返回,可能造成资源被占满导致阻塞。我一般的做法是先按延迟估算给一个基线,再在仿真里跑实际流量模型,观察通道利用率,逐步调优。

同ID保序这一点要特别注意。如果两个有数据依赖的访问用了相同ID,从设备必须按序返回,这会限制并行度;如果用了不同ID,就有可能出现后发的先回,软件侧必须能处理这种乱序。做DMA描述符链的时候,如果描述符之间有依赖,要么用相同ID保证顺序,要么在软件层面加同步,不能想当然。

4.4 AXI3、AXI4与AXI4-Lite的版本差异

这三个版本的区别需要说清楚,因为很多IP只支持其中之一。AXI3的写数据通道有WID信号,写交织粒度最多16拍,突发长度最大16;AXI4去掉了WID,写数据必须按序,但突发长度扩展到256拍,更适合大块连续传输。AXI4-Lite则是一个精简版,不支持突发、不支持ID、每次只能传一笔,但接口信号少很多,是寄存器访问场景的标准选择。

选型上有个常见误区:看到AXI4-Lite简单就想用它传数据流。这是不行的,Lite版本每笔传输都要重新给地址,效率极低,而且没有outstanding能力,延迟完全暴露。Lite只适合控制寄存器组,数据通路必须用完整的AXI4。

4.5 低功耗、QoS与区域信号的实际用途

AXI4还带了一些辅助信号。低功耗通道用于通知从设备即将进入低功耗状态,让从设备有机会完成收尾;QoS信号用来标记事务优先级,互联模块可以据此做调度;区域信号用来指示访问的目标区域,配合系统级缓存或者地址译码使用。

这些信号在实际项目里用不用?取决于系统复杂度。单主设备的简单系统,QoS和区域信号可以直接接常量,不用实现。但如果系统里有多个主设备竞争带宽,比如处理器和一个高优先级DMA共享存储控制器,QoS就很有价值:给DMA高优先级,保证它的实时性,处理器访问稍慢一点可以接受。我在一个音视频处理的项目里就用过这个机制,音频通路对抖动敏感,给它高QoS之后,欠载次数明显下降。

5. 三种总线的横向对比与选型决策

5.1 关键维度对比表

把三种总线的核心特性摆在一起看,差异一目了然。下面这张表是我自己整理时常看的维度,参数取值基于常见实现,具体项目还要以所用IP的手册为准。

对比维度APBAHBAXI
典型位宽32位为主32/64位32/64/128/256位
传输机制两相非流水流水线,地址数据重叠五通道分离,读写独立
突发支持不支持支持,最长16拍支持,AXI4最长256拍
地址边界限制无(单笔传输)1KB4KB
乱序完成不支持不支持支持,按ID区分
多主设备不支持支持,需仲裁器支持,互联实现
接口信号数量约10根约30根约100根以上
时序效率上限约50%接近100%接近100%
实现复杂度低中高
典型应用控制寄存器、低速外设中高性能主设备与存储高带宽数据通路

从表里能读出一个规律:性能提升的背后是复杂度的非线性增长。APB到AHB,信号翻了三倍,换来流水和突发;AHB到AXI,信号再翻三倍多,换来乱序和多通道并行。这个增长曲线提醒我们,能用低一级解决的绝不要往上跳。

5.2 选型决策流程与三个实战判据

我自己的选型流程是三步。第一步看带宽,算清楚设备峰值需要多少MB/s,和总线的可用带宽比。第二步看延迟敏感度,设备能不能容忍几十个周期的访问延迟,有没有硬实时约束。第三步看实现成本,包括接口逻辑面积、验证工作量、是否需要跨时钟域。

三个判据可以固化成规则。判据一:单笔传输、无突发需求、访问频率低于每秒十万次的设备,一律APB。判据二:需要突发但不需要乱序、主设备数量在三四个以内、位宽不超过64位的系统,AHB足够,别上AXI。判据三:需要多主设备高并发、有长延迟从设备、或者数据位宽超过64位,才考虑AXI。

还有一个容易被忽略的维度是验证成本。AXI的验证要覆盖五种通道的各种握手组合、乱序场景、错误注入,工作量可能是AHB的三到五倍。如果项目周期紧、团队对AXI不熟,用AHB加多路复用往往比强上AXI更快出结果。性能不是唯一指标,按时交付同样重要。

5.3 桥接方案的选择与注意事项

系统里需要混用三种总线时,桥接模块就是关键节点。常见的有AHB到APB桥、AXI到AHB桥、AXI到APB桥。

AHB到APB桥是最常见的组合,实现要点是把AHB的流水传输转换成APB的两相时序,中间要处理好等待周期和错误响应映射。这里有个坑:AHB支持突发,APB不支持,桥接模块必须把一笔突发拆成多笔单次传输,拆分过程中如果从设备返回错误,桥接模块要正确地把错误映射回AHB的响应,并且终止后续拆分。我见过桥接模块在错误后继续拆剩余拍数的设计,导致对无效地址的连续访问,虽然功能上不一定出错,但会浪费带宽,也可能触发外设的异常保护。

AXI到AHB桥的复杂度更高,因为要处理五通道到单总线的收敛、ID到顺序的映射、outstanding的管理。如果只是把低速AHB设备接到AXI域,用AXI到APB桥直接接可能更简单,中间省一级。选桥的时候要看清楚支持的最大outstanding、是否支持乱序、错误如何传播,这些参数在实际调试时都会成为关键线索。

6. 调试经验与常见问题排查

6.1 握手卡死与死锁的定位方法

总线挂死是调试中最常见也最耗时的问题。表现形式通常是仿真跑不动、波形上某个VALID一直高但READY一直低,或者整个系统无响应。排查的第一步是定位卡在哪个通道:看所有通道的VALID和READY,找出高VALID配低READY的那一对。

常见原因有几个。一是从设备侧状态机在某个分支忘了拉READY,比如只处理了正常路径,错误路径走进去就出不来。二是主设备在等一个永远不会来的响应,比如发出了读请求但从设备地址译码没命中,又没有返回错误响应,请求就悬着。三是跨时钟域握手处理不当,异步FIFO满或者空标志错误,导致一侧永远收不到。四是组合逻辑环,两个模块互相等对方的信号,仿真时表现为信号在同一个时刻反复震荡。

定位技巧上,我习惯先看复位后的初始状态是否干净,所有VALID应该为低,所有READY按协议该是高就高。然后单步跑第一笔传输,逐周期核对每个握手。如果第一笔就卡,问题在接口实现;如果跑了很多笔才卡,大概率是缓冲满、ID耗尽或者状态机进入异常分支。

注意:任何VALID拉高后不允许撤销,这是协议铁律。用断言把这条规则监控起来,比事后翻波形高效得多。

6.2 突发边界违例与地址对齐问题

突发跨边界和对齐错误是第二大类问题。症状往往是数据错位、写到相邻区域、或者从设备返回错误。这类问题在短传输测试里经常不出现,因为传输长度小,碰不到边界;等到跑大数据量才暴露。

排查方法很直接:抓波形看第一拍的地址和最后一拍的地址,算一下是否跨了1KB或4KB边界。同时检查地址是否按传输大小对齐,比如32位传输的地址低两位必须是0。有些主设备在计算地址时用了错误的步进,比如把字节数当成拍数,导致地址跳跃错误,这种从波形上一眼就能看出来。

预防措施是在主设备或DMA配置逻辑里加断言:检查起始地址对齐、检查传输长度除以每拍字节数后的拍数与突发长度是否一致、检查是否跨边界。我所在的团队现在把这几个断言做成了标准检查块,新模块接进来直接挂上,能在仿真早期拦住大部分问题。

6.3 跨时钟域与桥接延迟的实际影响

分层总线结构里,跨时钟域是绕不开的。AHB和APB通常不在同一个时钟域,桥接模块内部要做同步。同步做得不好,表现是偶发数据错误或者握手卡死,而且频率跟两个时钟的相位关系有关,很难稳定复现。

处理原则是:控制信号用两级触发器同步,数据信号用异步FIFO或者握手协议传递,绝不能让数据直接跨域采样。桥接模块的FIFO深度要按两侧时钟频率比和突发长度来算,如果高速侧比低速侧快很多,FIFO太浅会频繁反压,拖慢整体吞吐。

延迟方面要有个预期。一次从AXI域到APB域的访问,经过两级桥接,加上同步和握手,几十个周期是正常的。软件侧如果做轮询,要注意这个延迟,避免在紧密循环里连续读同一个寄存器。硬件侧如果做超时机制,超时阈值要给够,不能按单周期的思维设。

6.4 常见问题速查表

下面这张表是我这些年遇到的高频问题汇总,排查时可以直接对照。

现象可能原因排查手段处理方式
仿真卡住不动某通道VALID高READY低,握手死锁逐通道看握手信号检查从设备状态机全分支是否都拉READY
偶发数据错误跨时钟域未做同步,或VALID撤销加重同步断言,检查跨域逻辑数据走异步FIFO,VALID加稳定性断言
数据写到错误地址突发跨边界,地址计算错误抓首末拍地址,核对边界配置阶段预拆突发,加对齐断言
低速外设访问超时桥接FIFO太浅或等待周期过长看桥接模块反压信号加深FIFO,减少从设备等待周期
带宽不达预期outstanding不足或突发长度太短统计通道利用率提高outstanding,增大突发长度
写后读数据不一致读写通道乱序,缺少同步检查ID分配与依赖关系有依赖的访问用同ID或软件加屏障
错误响应被吞掉从设备PSLVERR或BRESP/RRESP接常量检查响应信号连接正确映射错误,软件侧处理异常
复位后首次访问失败复位释放顺序或初始状态不对看复位后各信号初值调整复位顺序,确保状态机从IDLE起步

7. 一个完整挂载实例:从需求到拓扑落地

7.1 需求梳理与带宽估算

拿一个模拟项目来说:某图像处理Demo,需要采集摄像头数据、做简单滤波、输出到显示接口,同时有串口调试、定时器、中断控制这些常规外设。处理器主频100MHz,图像分辨率1280乘720,帧率30,像素格式RGB888,也就是每像素3字节。

先算图像通路带宽:1280乘720乘3乘30,约83MB/s。考虑滤波需要读一次写一次,实际带宽翻倍到166MB/s。再看存储访问,如果滤波在片内SRAM做,SRAM控制器需要支撑这个读写速率。假设用100MHz、64位宽的AXI,理论带宽800MB/s,166MB/s的占用率约21%,余量充足,可以给其他主设备留空间。

控制类外设的带宽可以忽略,串口最高几Mbps,定时器只是寄存器读写。这类全部归到APB域。

7.2 拓扑划分与地址映射

按前面的估算,拓扑这样划:图像采集接口、滤波单元、SRAM控制器挂AXI;处理器通过一个AXI到AHB桥接访问部分中速外设;AHB再通过AHB到APB桥接挂低速外设。也可以简化成处理器直接挂AXI,低速外设通过AXI到APB桥接,少一级。具体选哪种看处理器接口类型和IP可得性。

地址映射我一般按功能分块,每块留足空间:

地址区间挂载设备总线类型空间大小
0x0000_0000 - 0x0000_FFFF片内SRAMAXI64KB
0x4000_0000 - 0x4000_FFFF图像采集接口寄存器AXI4-Lite64KB
0x4001_0000 - 0x4001_FFFF滤波单元配置AXI4-Lite64KB
0x5000_0000 - 0x5000_0FFF中断控制器APB4KB
0x5000_1000 - 0x5000_1FFF定时器组APB4KB
0x5000_2000 - 0x5000_2FFF串口APB4KB
0x5000_3000 - 0x5000_3FFFGPIO与引脚复用APB4KB

每个APB设备给4KB,实际用到的可能就几十个字节,但地址译码简单,软件侧也好看。这种"奢侈"分配在项目后期加外设时非常省事。

7.3 参数配置与关键节点设置

AXI侧的outstanding配置:图像通路的延迟主要来自SRAM访问,估计往返20个周期,目标吞吐每周期一笔,outstanding配32。突发长度设16拍,64位宽就是128字节一笔,远小于4KB边界,不会违规。地址按128字节对齐,起始地址的低7位为0。

APB侧的等待周期:串口和GPIO这类外设响应快,PREADY常高,零等待。定时器读取计数值可能需要几个周期同步,给2到3个等待周期。中断控制器的优先级判决组合逻辑较深,给1到2个等待周期,避免时序紧张。

桥接模块的FIFO深度:AXI到APB方向,考虑APB侧可能出现的等待,FIFO深度设8到16够用。如果APB域时钟比AXI域慢很多,比如慢四倍,深度要相应加大,避免高速侧频繁反压。

7.4 上板验证与观测点设置

上板之后,我习惯在几个关键节点埋观测点:AXI写地址通道的VALID与READY做计数器,统计实际利用率;桥接模块的FIFO水位,看是否有持续接近满的情况;APB访问的等待周期分布,看是否有异常长的等待。

这些计数器可以通过调试接口读出来,比抓波形直观得多。有一次就是通过FIFO水位计数发现某个外设的等待周期异常,追下去发现是从设备内部状态机在特定访问序列下多等了很多拍,改掉之后整体响应快了一截。

另外建议在系统里留一个总线错误计数器,统计ERROR响应的次数和地址。软件跑长时间测试时,这个计数器能第一时间告诉你有没有访问越界或者权限问题,比等到功能异常再去查省太多时间。

我个人在实际操作中的体会是,总线选型这件事最忌讳"一步到位"的思路。先把带宽和延迟算清楚,按需分配层级,用桥接把不同速度的设备隔开,比强行统一到一种总线上要稳得多。真正容易出问题的从来不是协议本身,而是边界条件:跨时钟域的同步、突发的边界拆分、握手的稳定性。这几处守住了,整套总线结构跑起来就很踏实。

需要专业的网站建设服务?

联系我们获取免费的网站建设咨询和方案报价,让我们帮助您实现业务目标

立即咨询